I..(CO)3Ni radical anion
- Formula: C3INiO3-
- Molecular weight: 269.6287

Gas phase thermochemistry data

Data compiled by: John E. Bartmess
Quantity | Value | Units | Method | Reference | Comment |
---|---|---|---|---|---|
ΔfH°gas | <-622.66 | kJ/mol | Ther | Jones, McDonald, et al., 1989 |

Ion clustering data

Data compiled by: John E. Bartmess
Clustering reactions
C3NiO3- + = C3INiO3-
By formula: C3NiO3- + I = C3INiO3-
Quantity | Value | Units | Method | Reference | Comment |
---|---|---|---|---|---|
ΔrH° | >230.1 | kJ/mol | IMRB | Jones, McDonald, et al., 1989 | gas phase |

Reaction thermochemistry data

Data compiled by: John E. Bartmess
Individual Reactions
C3NiO3- + = C3INiO3-
By formula: C3NiO3- + I = C3INiO3-
Quantity | Value | Units | Method | Reference | Comment |
---|---|---|---|---|---|
ΔrH° | >55.00 | kcal/mol | IMRB | Jones, McDonald, et al., 1989 | gas phase |

References

Jones, McDonald, et al., 1989
Jones, M.T.; McDonald, R.N.; Schell, P.L.; Ali, M.H.,
Kinetics and Mechanism of Halogen Atom Transfer Reactions between Haloalkanes and Several 17-Electron Transition Metal Complex Negative Ions in the Gas Phase,
J. Am. Chem. Soc., 1989, 111, 16, 5983, https://doi.org/10.1021/ja00198a001
. [all data]