Cl..(CO)3Ni radical anion
- Formula: C3ClNiO3-
- Molecular weight: 178.177

Gas phase thermochemistry data

Data compiled by: John E. Bartmess
Quantity | Value | Units | Method | Reference | Comment |
---|---|---|---|---|---|
ΔfH°gas | <-169.55 | kcal/mol | Ther | Jones, McDonald, et al., 1989 |

Ion clustering data

Data compiled by: John E. Bartmess
Clustering reactions
C3NiO3- + = C3ClNiO3-
By formula: C3NiO3- + Cl = C3ClNiO3-
Quantity | Value | Units | Method | Reference | Comment |
---|---|---|---|---|---|
ΔrH° | >79.20 | kcal/mol | IMRB | Jones, McDonald, et al., 1989 | gas phase |

References

Jones, McDonald, et al., 1989
Jones, M.T.; McDonald, R.N.; Schell, P.L.; Ali, M.H.,
Kinetics and Mechanism of Halogen Atom Transfer Reactions between Haloalkanes and Several 17-Electron Transition Metal Complex Negative Ions in the Gas Phase,
J. Am. Chem. Soc., 1989, 111, 16, 5983, https://doi.org/10.1021/ja00198a001
. [all data]