Br..(CO)4Fe radical anion
- Formula: C4BrFeO4-
- Molecular weight: 247.790

Gas phase thermochemistry data

Data compiled by: John E. Bartmess
Quantity | Value | Units | Method | Reference | Comment |
---|---|---|---|---|---|
ΔfH°gas | <-204.72 | kcal/mol | Ther | Jones, McDonald, et al., 1989 |

Ion clustering data

Data compiled by: John E. Bartmess
Clustering reactions
C4FeO4- + = C4BrFeO4-
By formula: C4FeO4- + Br = C4BrFeO4-
Quantity | Value | Units | Method | Reference | Comment |
---|---|---|---|---|---|
ΔrH° | >70.60 | kcal/mol | IMRB | Jones, McDonald, et al., 1989 | gas phase |

Reaction thermochemistry data

Data compiled by: John E. Bartmess

Individual Reactions

C4FeO4- + Bromine = C4BrFeO4-

By formula: C4FeO4- + Br = C4BrFeO4-

Quantity Value Units Method Reference Comment
Δr>295.4kJ/molIMRBJones, McDonald, et al., 1989gas phase

References

Jones, McDonald, et al., 1989
Jones, M.T.; McDonald, R.N.; Schell, P.L.; Ali, M.H.,
Kinetics and Mechanism of Halogen Atom Transfer Reactions between Haloalkanes and Several 17-Electron Transition Metal Complex Negative Ions in the Gas Phase,
J. Am. Chem. Soc., 1989, 111, 16, 5983, https://doi.org/10.1021/ja00198a001
. [all data]