I..(CO)5Cr radical anion
- Formula: C5CrIO5-
- Molecular weight: 318.9516

Gas phase thermochemistry data

Data compiled by: John E. Bartmess
Quantity | Value | Units | Method | Reference | Comment |
---|---|---|---|---|---|
ΔfH°gas | <-132.5 | kJ/mol | Ther | Jones, McDonald, et al., 1989 |

Ion clustering data

Data compiled by: John E. Bartmess
Clustering reactions
C5CrO5- + = C5CrIO5-
By formula: C5CrO5- + I = C5CrIO5-
Quantity | Value | Units | Method | Reference | Comment |
---|---|---|---|---|---|
ΔrH° | >239.3 | kJ/mol | IMRB | Jones, McDonald, et al., 1989 | gas phase |

Reaction thermochemistry data

Data compiled by: John E. Bartmess
Individual Reactions
C5CrO5- + = C5CrIO5-
By formula: C5CrO5- + I = C5CrIO5-
Quantity | Value | Units | Method | Reference | Comment |
---|---|---|---|---|---|
ΔrH° | >57.20 | kcal/mol | IMRB | Jones, McDonald, et al., 1989 | gas phase |

References

Jones, McDonald, et al., 1989
Jones, M.T.; McDonald, R.N.; Schell, P.L.; Ali, M.H.,
Kinetics and Mechanism of Halogen Atom Transfer Reactions between Haloalkanes and Several 17-Electron Transition Metal Complex Negative Ions in the Gas Phase,
J. Am. Chem. Soc., 1989, 111, 16, 5983, https://doi.org/10.1021/ja00198a001
. [all data]