Cl..n3(C3H5)Re(CO)3 radical anion
- Formula: C6H5ClO3Re-
- Molecular weight: 346.763

Gas phase thermochemistry data

Data compiled by: John E. Bartmess
Quantity | Value | Units | Method | Reference | Comment |
---|---|---|---|---|---|
ΔfH°gas | <-53.81 | kcal/mol | Ther | Jones, McDonald, et al., 1989 |

Reaction thermochemistry data

Data compiled by: John E. Bartmess
Individual Reactions
C6H5O3Re + = C6H5ClO3Re-
By formula: C6H5O3Re + Cl = C6H5ClO3Re-
Quantity | Value | Units | Method | Reference | Comment |
---|---|---|---|---|---|
ΔrH° | >82.80 | kcal/mol | IMRB | Jones, McDonald, et al., 1989 | gas phase |

References

Jones, McDonald, et al., 1989
Jones, M.T.; McDonald, R.N.; Schell, P.L.; Ali, M.H.,
Kinetics and Mechanism of Halogen Atom Transfer Reactions between Haloalkanes and Several 17-Electron Transition Metal Complex Negative Ions in the Gas Phase,
J. Am. Chem. Soc., 1989, 111, 16, 5983, https://doi.org/10.1021/ja00198a001
. [all data]