Br..(CO)4MnBr radical anion
- Formula: C4Br2MnO4-
- Molecular weight: 326.787

Gas phase thermochemistry data

Data compiled by: John E. Bartmess
Quantity | Value | Units | Method | Reference | Comment |
---|---|---|---|---|---|
ΔfH°gas | <-183.5 | kJ/mol | Ther | Jones, McDonald, et al., 1989 |

Reaction thermochemistry data

Data compiled by: John E. Bartmess
Individual Reactions
C4BrIMnO4 + = C4Br2MnO4-
By formula: C4BrIMnO4 + Br = C4Br2MnO4-
Quantity | Value | Units | Method | Reference | Comment |
---|---|---|---|---|---|
ΔrH° | >295.4 | kJ/mol | IMRB | Jones, McDonald, et al., 1989 | gas phase |

References

Jones, McDonald, et al., 1989
Jones, M.T.; McDonald, R.N.; Schell, P.L.; Ali, M.H.,
Kinetics and Mechanism of Halogen Atom Transfer Reactions between Haloalkanes and Several 17-Electron Transition Metal Complex Negative Ions in the Gas Phase,
J. Am. Chem. Soc., 1989, 111, 16, 5983, https://doi.org/10.1021/ja00198a001
. [all data]