Cl..(CO)4ReBr radical anion
- Formula: C4BrClO4Re-
- Molecular weight: 413.605

Gas phase thermochemistry data

Data compiled by: John E. Bartmess
Quantity | Value | Units | Method | Reference | Comment |
---|---|---|---|---|---|
ΔfH°gas | <-50.12 | kcal/mol | Ther | Jones, McDonald, et al., 1989 |

Reaction thermochemistry data

Data compiled by: John E. Bartmess
Individual Reactions
C4BrClO4Re + = C4BrClO4Re-
By formula: C4BrClO4Re + Cl = C4BrClO4Re-
Quantity | Value | Units | Method | Reference | Comment |
---|---|---|---|---|---|
ΔrH° | >79.20 | kcal/mol | IMRB | Jones, McDonald, et al., 1989 | gas phase |

References

Jones, McDonald, et al., 1989
Jones, M.T.; McDonald, R.N.; Schell, P.L.; Ali, M.H.,
Kinetics and Mechanism of Halogen Atom Transfer Reactions between Haloalkanes and Several 17-Electron Transition Metal Complex Negative Ions in the Gas Phase,
J. Am. Chem. Soc., 1989, 111, 16, 5983, https://doi.org/10.1021/ja00198a001
. [all data]