CH2=C(cPr)O anion
- Formula: C5H7O-
- Molecular weight: 83.1090

Gas phase ion energetics data

Data compiled by: John E. Bartmess
Electron affinity of neutral species
EAneutral (eV) | Method | Reference | Comment |
---|---|---|---|
1.90 ± 0.20 | D-EA | Brickhouse and Squires, 1988 | Between MeCHO, Me2C=NOH |
Protonation reactions
By formula: C5H7O- + H+ = C5H8O
Quantity | Value | Units | Method | Reference | Comment |
---|---|---|---|---|---|
ΔrH° | 365.7 ± 4.1 | kcal/mol | G+TS | Brickhouse and Squires, 1988 | gas phase; Between MeCHO, Me2C=NOH |
Quantity | Value | Units | Method | Reference | Comment |
ΔrG° | 359.0 ± 4.0 | kcal/mol | IMRB | Brickhouse and Squires, 1988 | gas phase; Between MeCHO, Me2C=NOH |

Reaction thermochemistry data

Data compiled by: John E. Bartmess

Individual Reactions

C5H7O- + Hydrogen cation = Ethanone, 1-cyclopropyl-

By formula: C5H7O- + H+ = C5H8O

Quantity Value Units Method Reference Comment
Δr365.7 ± 4.1kcal/molG+TSBrickhouse and Squires, 1988gas phase; Between MeCHO, Me2C=NOH
Quantity Value Units Method Reference Comment
Δr359.0 ± 4.0kcal/molIMRBBrickhouse and Squires, 1988gas phase; Between MeCHO, Me2C=NOH

References

Brickhouse and Squires, 1988
Brickhouse, M.D.; Squires, R.R.,
Gas Phase Bronsted vs. Lewis Acid-Base Reactions of 6,6-Dimethylfulvene. A Sensitive Probe of the Electronic Structures of Organic Anions,
J. Am. Chem. Soc., 1988, 110, 9, 2706, https://doi.org/10.1021/ja00217a002
. [all data]