benzynide anion
- Formula: C6H3-
- Molecular weight: 75.0886
- IUPAC Standard InChIKey: WZBBFBWNGZILLY-UHFFFAOYSA-N
- Chemical structure:
View 3d structure (requires JavaScript / HTML 5) - Permanent link for this species. Use this link for bookmarking this species for future reference.

Reaction thermochemistry data

Data compiled by: John E. Bartmess
Individual Reactions
Quantity | Value | Units | Method | Reference | Comment |
---|---|---|---|---|---|
ΔrH° | 1584. ± 13. | kJ/mol | G+TS | Guo and Grabowski, 1991 | gas phase; Acidity between MeOH and tBuOH, comparable to EtOH |
Quantity | Value | Units | Method | Reference | Comment |
ΔrG° | 1552. ± 13. | kJ/mol | IMRB | Guo and Grabowski, 1991 | gas phase; Acidity between MeOH and tBuOH, comparable to EtOH |
ΔrG° | 1556. ± 21. | kJ/mol | IMRB | Gronert and DePuy, 1989 | gas phase |

Gas phase ion energetics data

Data compiled by: John E. Bartmess
Electron affinity of neutral species
EAneutral (eV) | Method | Reference | Comment |
---|---|---|---|
1.51 ± 0.27 | D-EA | Guo and Grabowski, 1991 | Acidity between MeOH and tBuOH, comparable to EtOH |
Protonation reactions
Quantity | Value | Units | Method | Reference | Comment |
---|---|---|---|---|---|
ΔrH° | 1584. ± 13. | kJ/mol | G+TS | Guo and Grabowski, 1991 | gas phase; Acidity between MeOH and tBuOH, comparable to EtOH |
Quantity | Value | Units | Method | Reference | Comment |
ΔrG° | 1552. ± 13. | kJ/mol | IMRB | Guo and Grabowski, 1991 | gas phase; Acidity between MeOH and tBuOH, comparable to EtOH |
ΔrG° | 1556. ± 21. | kJ/mol | IMRB | Gronert and DePuy, 1989 | gas phase |

References

Guo and Grabowski, 1991
Guo, Y.L.; Grabowski, J.J.,
Reactions of the Benzyne Radical Anion in the Gas Phase, the Acidity of the Phenyl Radical, and the Heat of Formation of ortho-Benzyne,
J. Am. Chem. Soc., 1991, 113, 16, 5923, https://doi.org/10.1021/ja00016a001
. [all data]
Gronert and DePuy, 1989
Gronert, S.; DePuy, C.H.,
The Dehydrophenyl Anion and the Gas Phase Ion Chemistry of Benzyne,
J. Am. Chem. Soc., 1989, 111, 26, 9253, https://doi.org/10.1021/ja00208a032
. [all data]