F2Si(Me)CH2 anion
- Formula: C2H5F2Si-
- Molecular weight: 95.1440

Reaction thermochemistry data

Data compiled by: John E. Bartmess
Individual Reactions
By formula: C2H5F2Si- + H+ = C2H6F2Si
Quantity | Value | Units | Method | Reference | Comment |
---|---|---|---|---|---|
ΔrH° | 1590. ± 19. | kJ/mol | G+TS | Allison and McMahon, 1990 | gas phase; Between PhCH3, HCF3 |
Quantity | Value | Units | Method | Reference | Comment |
ΔrG° | 1554. ± 19. | kJ/mol | IMRB | Allison and McMahon, 1990 | gas phase; Between PhCH3, HCF3 |

Gas phase ion energetics data

Data compiled by: John E. Bartmess
Protonation reactions
By formula: C2H5F2Si- + H+ = C2H6F2Si
Quantity | Value | Units | Method | Reference | Comment |
---|---|---|---|---|---|
ΔrH° | 1590. ± 19. | kJ/mol | G+TS | Allison and McMahon, 1990 | gas phase; Between PhCH3, HCF3 |
Quantity | Value | Units | Method | Reference | Comment |
ΔrG° | 1554. ± 19. | kJ/mol | IMRB | Allison and McMahon, 1990 | gas phase; Between PhCH3, HCF3 |

References

Allison and McMahon, 1990
Allison, C.E.; McMahon, T.B.,
How Strong is the Si=C Bond in Fluoro- and Methyl Substituted Silaethylenes? An Experimental Determination of Pi Bond Strengths,
J. Am. Chem. Soc., 1990, 112, 5, 1672, https://doi.org/10.1021/ja00161a002
. [all data]