Co(PF3)4 anion
- Formula: CoF12P4-
- Molecular weight: 410.809630

Gas phase ion energetics data

Data compiled by: John E. Bartmess
Protonation reactions
CoF12P4- + = HCoF12P4
By formula: CoF12P4- + H+ = HCoF12P4
Quantity | Value | Units | Method | Reference | Comment |
---|---|---|---|---|---|
ΔrG° | <1293. ± 17. | kJ/mol | IMRB | Miller, Kawamura, et al., 1990 | gas phase; More acidic than CF3SO3H |

References

Miller, Kawamura, et al., 1990
Miller, A.E.S.; Kawamura, A.R.; Miller, T.M.,
Effects of Metal and Ligand Substitutions on Gas-Phase Acidities of Transition-Metal Hydrides,
J. Am. Chem. Soc., 1990, 112, 1, 457, https://doi.org/10.1021/ja00157a075
. [all data]