Ir(PF3)4 anion
- Formula: F12IrP4-
- Molecular weight: 544.093

Reaction thermochemistry data

Data compiled by: John E. Bartmess
Individual Reactions
F12IrP4- + = HF12IrP4
By formula: F12IrP4- + H+ = HF12IrP4
Quantity | Value | Units | Method | Reference | Comment |
---|---|---|---|---|---|
ΔrG° | <1293. ± 13. | kJ/mol | IMRB | Miller, Kawamura, et al., 1990 | gas phase; Between FSO3H and CF3SO3H |

Gas phase ion energetics data

Data compiled by: John E. Bartmess
Protonation reactions
F12IrP4- + = HF12IrP4
By formula: F12IrP4- + H+ = HF12IrP4
Quantity | Value | Units | Method | Reference | Comment |
---|---|---|---|---|---|
ΔrG° | <1293. ± 13. | kJ/mol | IMRB | Miller, Kawamura, et al., 1990 | gas phase; Between FSO3H and CF3SO3H |

References

Miller, Kawamura, et al., 1990
Miller, A.E.S.; Kawamura, A.R.; Miller, T.M.,
Effects of Metal and Ligand Substitutions on Gas-Phase Acidities of Transition-Metal Hydrides,
J. Am. Chem. Soc., 1990, 112, 1, 457, https://doi.org/10.1021/ja00157a075
. [all data]