MeCOCO2 anion
- Formula: C3H3O3-
- Molecular weight: 87.0547

Reaction thermochemistry data

Data compiled by: John E. Bartmess
Individual Reactions
By formula: C3H3O3- + H+ = C3H4O3
Quantity | Value | Units | Method | Reference | Comment |
---|---|---|---|---|---|
ΔrH° | 1395. ± 12. | kJ/mol | G+TS | Graul, Schnute, et al., 1990 | gas phase |
Quantity | Value | Units | Method | Reference | Comment |
ΔrG° | 1366. ± 12. | kJ/mol | CIDC | Graul, Schnute, et al., 1990 | gas phase |

Gas phase ion energetics data

Data compiled by: John E. Bartmess
Electron affinity of neutral species
EAneutral (eV) | Method | Reference | Comment |
---|---|---|---|
4.04 ± 0.18 | D-EA | Graul, Schnute, et al., 1990 |
Protonation reactions
By formula: C3H3O3- + H+ = C3H4O3
Quantity | Value | Units | Method | Reference | Comment |
---|---|---|---|---|---|
ΔrH° | 1395. ± 12. | kJ/mol | G+TS | Graul, Schnute, et al., 1990 | gas phase |
Quantity | Value | Units | Method | Reference | Comment |
ΔrG° | 1366. ± 12. | kJ/mol | CIDC | Graul, Schnute, et al., 1990 | gas phase |

References

Graul, Schnute, et al., 1990
Graul, S.T.; Schnute, M.E.; Squires, R.R.,
Gas-Phase Acidities of Carboxylic Acids and Alcohols from Collision-Induced Dissociation of Dimer Cluster Ions,
Int. J. Mass Spectrom. Ion Proc., 1990, 96, 2, 181, https://doi.org/10.1016/0168-1176(90)87028-F
. [all data]