CH2=C(Me)CO2 anion
- Formula: C4H5O2-
- Molecular weight: 85.0818

Reaction thermochemistry data

Data compiled by: John E. Bartmess
Individual Reactions
By formula: C4H5O2- + H+ = C4H6O2
Quantity | Value | Units | Method | Reference | Comment |
---|---|---|---|---|---|
ΔrH° | 344.1 ± 2.9 | kcal/mol | G+TS | Graul, Schnute, et al., 1990 | gas phase |
Quantity | Value | Units | Method | Reference | Comment |
ΔrG° | 337.1 ± 2.8 | kcal/mol | CIDC | Graul, Schnute, et al., 1990 | gas phase |

Gas phase ion energetics data

Data compiled by: John E. Bartmess
Electron affinity of neutral species
EAneutral (eV) | Method | Reference | Comment |
---|---|---|---|
3.58 ± 0.18 | D-EA | Graul, Schnute, et al., 1990 |
Protonation reactions
By formula: C4H5O2- + H+ = C4H6O2
Quantity | Value | Units | Method | Reference | Comment |
---|---|---|---|---|---|
ΔrH° | 344.1 ± 2.9 | kcal/mol | G+TS | Graul, Schnute, et al., 1990 | gas phase |
Quantity | Value | Units | Method | Reference | Comment |
ΔrG° | 337.1 ± 2.8 | kcal/mol | CIDC | Graul, Schnute, et al., 1990 | gas phase |

References

Graul, Schnute, et al., 1990
Graul, S.T.; Schnute, M.E.; Squires, R.R.,
Gas-Phase Acidities of Carboxylic Acids and Alcohols from Collision-Induced Dissociation of Dimer Cluster Ions,
Int. J. Mass Spectrom. Ion Proc., 1990, 96, 2, 181, https://doi.org/10.1016/0168-1176(90)87028-F
. [all data]