MeCH=CHCH2O anion
- Formula: C4H7O-
- Molecular weight: 71.0983

Reaction thermochemistry data

Data compiled by: John E. Bartmess
Individual Reactions
By formula: C4H7O- + H+ = C4H8O
Quantity | Value | Units | Method | Reference | Comment |
---|---|---|---|---|---|
ΔrH° | 1564. ± 12. | kJ/mol | G+TS | Graul, Schnute, et al., 1990 | gas phase; Mixture of cis and trans isomers |
Quantity | Value | Units | Method | Reference | Comment |
ΔrG° | 1536. ± 12. | kJ/mol | CIDC | Graul, Schnute, et al., 1990 | gas phase; Mixture of cis and trans isomers |

Gas phase ion energetics data

Data compiled by: John E. Bartmess
Electron affinity of neutral species
EAneutral (eV) | Method | Reference | Comment |
---|---|---|---|
1.90 ± 0.15 | D-EA | Graul, Schnute, et al., 1990 | Mixture of cis and trans isomers |
Protonation reactions
By formula: C4H7O- + H+ = C4H8O
Quantity | Value | Units | Method | Reference | Comment |
---|---|---|---|---|---|
ΔrH° | 1564. ± 12. | kJ/mol | G+TS | Graul, Schnute, et al., 1990 | gas phase; Mixture of cis and trans isomers |
Quantity | Value | Units | Method | Reference | Comment |
ΔrG° | 1536. ± 12. | kJ/mol | CIDC | Graul, Schnute, et al., 1990 | gas phase; Mixture of cis and trans isomers |

References

Graul, Schnute, et al., 1990
Graul, S.T.; Schnute, M.E.; Squires, R.R.,
Gas-Phase Acidities of Carboxylic Acids and Alcohols from Collision-Induced Dissociation of Dimer Cluster Ions,
Int. J. Mass Spectrom. Ion Proc., 1990, 96, 2, 181, https://doi.org/10.1016/0168-1176(90)87028-F
. [all data]