C48 anion

Gas phase ion energetics data

Data compiled by: John E. Bartmess

Electron affinity of neutral species

EAneutral (eV) Method Reference Comment
<3.10 ± 0.20LPESYang, Pettiette, et al., 1987Threshold from graph. Onset based on analogy with Cu cluster data.

References

Yang, Pettiette, et al., 1987
Yang, S.H.; Pettiette, C.L.; Conceicao, J.; Cheshnovsky, O.; Smalley, R.E., UPS of Buckminsterfullerene and other Large Clusters of Carbon, Chem. Phys. Lett., 1987, 139, 3-4, 233, https://doi.org/10.1016/0009-2614(87)80548-1 . [all data]