CeI4 anion
- Formula: CeI4-
- Molecular weight: 647.734

Gas phase thermochemistry data

Data compiled by: John E. Bartmess
Quantity | Value | Units | Method | Reference | Comment |
---|---|---|---|---|---|
ΔfH°gas | -807.51 | kJ/mol | Ther | Chantry, 1976 |

References

Chantry, 1976
Chantry, P.J.,
Negative Ion Formation in Cerium Triiodide,
J. Chem. Phys., 1976, 65, 11, 4412, https://doi.org/10.1063/1.432992
. [all data]