Phenazine anion

Gas phase thermochemistry data

Data compiled by: John E. Bartmess

Quantity Value Units Method Reference Comment
Δfgas217. ± 10.kJ/molR-EADillow and Kebarle, 1989ΔGea(423 K) = -29.5 kcal/mol; ΔSea =-1.5, taken as that of anthracene, from Kebarle and Chowdhury, 1987. 9,10-diazaanthracene

References

Dillow and Kebarle, 1989
Dillow, G.W.; Kebarle, P., Electron Affinities of aza-substituted polycyclic aromatic hydrocarbons, Can. J. Chem., 1989, 67, 10, 1628, https://doi.org/10.1139/v89-249 . [all data]

Kebarle and Chowdhury, 1987
Kebarle, P.; Chowdhury, S., Electron affinities and electron transfer reactions, Chem. Rev., 1987, 87, 513. [all data]