H2O..PhS anion
- Formula: C6H7OS-
- Molecular weight: 127.185

Gas phase thermochemistry data

Data compiled by: John E. Bartmess
Quantity | Value | Units | Method | Reference | Comment |
---|---|---|---|---|---|
ΔfH°gas | -283. ± 9.2 | kJ/mol | Ther | Sieck and Meot-ner, 1989 |

Ion clustering data

Data compiled by: John E. Bartmess
Clustering reactions
By formula: C6H5S- + H2O = C6H7OS-
Quantity | Value | Units | Method | Reference | Comment |
---|---|---|---|---|---|
ΔrH° | 47.70 ± 0.84 | kJ/mol | TDAs | Sieck and Meot-ner, 1989 | gas phase |
Quantity | Value | Units | Method | Reference | Comment |
ΔrG° | 23.4 ± 2.9 | kJ/mol | TDAs | Sieck and Meot-ner, 1989 | gas phase |

Reaction thermochemistry data

Data compiled by: John E. Bartmess

Individual Reactions

thiophenoxide anion + Water = C6H7OS-

By formula: C6H5S- + H2O = C6H7OS-

Quantity Value Units Method Reference Comment
Δr11.40 ± 0.20kcal/molTDAsSieck and Meot-ner, 1989gas phase
Quantity Value Units Method Reference Comment
Δr5.60 ± 0.70kcal/molTDAsSieck and Meot-ner, 1989gas phase

References

Sieck and Meot-ner, 1989
Sieck, L.W.; Meot-ner, M.,
Ionic Hydrogen Bond and Ion Solvation. 8. RS-..HOR Bond Strengths. Correlation with Acidities.,
J. Phys. Chem., 1989, 93, 4, 1586, https://doi.org/10.1021/j100341a079
. [all data]