tBuOH..PhS anion
- Formula: C10H15OS-
- Molecular weight: 183.291

Gas phase thermochemistry data

Data compiled by: John E. Bartmess
Quantity | Value | Units | Method | Reference | Comment |
---|---|---|---|---|---|
ΔfH°gas | -367. ± 9.2 | kJ/mol | Ther | Sieck and Meot-ner, 1989 |

Ion clustering data

Data compiled by: John E. Bartmess
Clustering reactions
By formula: C6H5S- + C4H10O = C10H15OS-
Quantity | Value | Units | Method | Reference | Comment |
---|---|---|---|---|---|
ΔrH° | 61.09 ± 0.42 | kJ/mol | TDAs | Sieck and Meot-ner, 1989 | gas phase |
Quantity | Value | Units | Method | Reference | Comment |
ΔrG° | 30.1 ± 2.1 | kJ/mol | TDAs | Sieck and Meot-ner, 1989 | gas phase |

Reaction thermochemistry data

Data compiled by: John E. Bartmess

Individual Reactions

thiophenoxide anion + 2-Propanol, 2-methyl- = C10H15OS-

By formula: C6H5S- + C4H10O = C10H15OS-

Quantity Value Units Method Reference Comment
Δr61.09 ± 0.42kJ/molTDAsSieck and Meot-ner, 1989gas phase
Quantity Value Units Method Reference Comment
Δr30.1 ± 2.1kJ/molTDAsSieck and Meot-ner, 1989gas phase

References

Sieck and Meot-ner, 1989
Sieck, L.W.; Meot-ner, M.,
Ionic Hydrogen Bond and Ion Solvation. 8. RS-..HOR Bond Strengths. Correlation with Acidities.,
J. Phys. Chem., 1989, 93, 4, 1586, https://doi.org/10.1021/j100341a079
. [all data]