CF3CH2OH..PhS anion
- Formula: C8H8F3OS-
- Molecular weight: 209.209

Gas phase thermochemistry data

Data compiled by: John E. Bartmess
Quantity | Value | Units | Method | Reference | Comment |
---|---|---|---|---|---|
ΔfH°gas | -231.8 ± 2.2 | kcal/mol | Ther | Sieck and Meot-ner, 1989 |

Reaction thermochemistry data

Data compiled by: John E. Bartmess
Individual Reactions
By formula: C6H5S- + C2H3F3O = C8H8F3OS-
Quantity | Value | Units | Method | Reference | Comment |
---|---|---|---|---|---|
ΔrH° | 21.00 ± 0.20 | kcal/mol | TDAs | Sieck and Meot-ner, 1989 | gas phase |
Quantity | Value | Units | Method | Reference | Comment |
ΔrG° | 13.50 ± 0.60 | kcal/mol | TDAs | Sieck and Meot-ner, 1989 | gas phase |

Ion clustering data

Data compiled by: John E. Bartmess
Clustering reactions
By formula: C6H5S- + C2H3F3O = C8H8F3OS-
Quantity | Value | Units | Method | Reference | Comment |
---|---|---|---|---|---|
ΔrH° | 21.00 ± 0.20 | kcal/mol | TDAs | Sieck and Meot-ner, 1989 | gas phase |
Quantity | Value | Units | Method | Reference | Comment |
ΔrG° | 13.50 ± 0.60 | kcal/mol | TDAs | Sieck and Meot-ner, 1989 | gas phase |

References

Sieck and Meot-ner, 1989
Sieck, L.W.; Meot-ner, M.,
Ionic Hydrogen Bond and Ion Solvation. 8. RS-..HOR Bond Strengths. Correlation with Acidities.,
J. Phys. Chem., 1989, 93, 4, 1586, https://doi.org/10.1021/j100341a079
. [all data]