MeCO2H..PhS anion
- Formula: C8H9O2S-
- Molecular weight: 169.221

Gas phase thermochemistry data

Data compiled by: John E. Bartmess
Quantity | Value | Units | Method | Reference | Comment |
---|---|---|---|---|---|
ΔfH°gas | -511.3 ± 9.2 | kJ/mol | Ther | Sieck and Meot-ner, 1989 |

Ion clustering data

Data compiled by: John E. Bartmess
Clustering reactions
By formula: C6H5S- + C2H4O2 = C8H9O2S-
Quantity | Value | Units | Method | Reference | Comment |
---|---|---|---|---|---|
ΔrH° | 84.94 ± 0.42 | kJ/mol | TDAs | Sieck and Meot-ner, 1989 | gas phase |
Quantity | Value | Units | Method | Reference | Comment |
ΔrG° | 52.3 ± 1.7 | kJ/mol | TDAs | Sieck and Meot-ner, 1989 | gas phase |

Reaction thermochemistry data

Data compiled by: John E. Bartmess
Individual Reactions
By formula: C6H5S- + C2H4O2 = C8H9O2S-
Quantity | Value | Units | Method | Reference | Comment |
---|---|---|---|---|---|
ΔrH° | 20.30 ± 0.10 | kcal/mol | TDAs | Sieck and Meot-ner, 1989 | gas phase |
Quantity | Value | Units | Method | Reference | Comment |
ΔrG° | 12.50 ± 0.40 | kcal/mol | TDAs | Sieck and Meot-ner, 1989 | gas phase |

References

Sieck and Meot-ner, 1989
Sieck, L.W.; Meot-ner, M.,
Ionic Hydrogen Bond and Ion Solvation. 8. RS-..HOR Bond Strengths. Correlation with Acidities.,
J. Phys. Chem., 1989, 93, 4, 1586, https://doi.org/10.1021/j100341a079
. [all data]