EtCO2H..PhS anion
- Formula: C9H11O2S-
- Molecular weight: 183.248

Reaction thermochemistry data

Data compiled by: John E. Bartmess
Individual Reactions
By formula: C6H5S- + C3H6O2 = C9H11O2S-
Quantity | Value | Units | Method | Reference | Comment |
---|---|---|---|---|---|
ΔrH° | 83.7 ± 1.7 | kJ/mol | TDAs | Sieck and Meot-ner, 1989 | gas phase |
Quantity | Value | Units | Method | Reference | Comment |
ΔrG° | 51.9 ± 5.4 | kJ/mol | TDAs | Sieck and Meot-ner, 1989 | gas phase |

Ion clustering data

Data compiled by: John E. Bartmess
Clustering reactions
By formula: C6H5S- + C3H6O2 = C9H11O2S-
Quantity | Value | Units | Method | Reference | Comment |
---|---|---|---|---|---|
ΔrH° | 83.7 ± 1.7 | kJ/mol | TDAs | Sieck and Meot-ner, 1989 | gas phase |
Quantity | Value | Units | Method | Reference | Comment |
ΔrG° | 51.9 ± 5.4 | kJ/mol | TDAs | Sieck and Meot-ner, 1989 | gas phase |

Gas phase thermochemistry data

Data compiled by: John E. Bartmess
Quantity | Value | Units | Method | Reference | Comment |
---|---|---|---|---|---|
ΔfH°gas | -530.5 ± 9.2 | kJ/mol | Ther | Sieck and Meot-ner, 1989 |

References

Sieck and Meot-ner, 1989
Sieck, L.W.; Meot-ner, M.,
Ionic Hydrogen Bond and Ion Solvation. 8. RS-..HOR Bond Strengths. Correlation with Acidities.,
J. Phys. Chem., 1989, 93, 4, 1586, https://doi.org/10.1021/j100341a079
. [all data]