WF6..F anion
- Formula: F7W-
- Molecular weight: 316.83

Gas phase thermochemistry data

Data compiled by: John E. Bartmess
Quantity | Value | Units | Method | Reference | Comment |
---|---|---|---|---|---|
ΔfH°gas | -541.6 ± 5.8 | kcal/mol | IMRB | George and Beauchamp, 1979 | Fluoride Affinity: SiF4 < WF6 < BF3 |

Gas phase ion energetics data

Data compiled by: John E. Bartmess
Electron affinity of neutral species
EAneutral (eV) | Method | Reference | Comment |
---|---|---|---|
<6.504618 | IMRB | George and Beauchamp, 1979 | Fluoride Affinity: SiF4 < WF6 < BF3 |

References

George and Beauchamp, 1979
George, P.M.; Beauchamp, J.L.,
The electron and fluoride affinites of tungsten hexafluoride by ICR spectroscopy,
Chem. Phys., 1979, 36, 345. [all data]