MeSiH2CH2 anion
- Formula: C2H7Si-
- Molecular weight: 59.1630

Gas phase ion energetics data

Data compiled by: John E. Bartmess
Protonation reactions
By formula: C2H7Si- + H+ = C2H8Si
Quantity | Value | Units | Method | Reference | Comment |
---|---|---|---|---|---|
ΔrH° | 392.8 ± 6.1 | kcal/mol | G+TS | Damrauer, Kass, et al., 1988 | gas phase; Between Me2NH and fluorobenzene |
Quantity | Value | Units | Method | Reference | Comment |
ΔrG° | 384.0 ± 6.0 | kcal/mol | IMRB | Damrauer, Kass, et al., 1988 | gas phase; Between Me2NH and fluorobenzene |

Reaction thermochemistry data

Data compiled by: John E. Bartmess

Individual Reactions

C2H7Si- + Hydrogen cation = Silane, dimethyl-

By formula: C2H7Si- + H+ = C2H8Si

Quantity Value Units Method Reference Comment
Δr1643. ± 26.kJ/molG+TSDamrauer, Kass, et al., 1988gas phase; Between Me2NH and fluorobenzene
Quantity Value Units Method Reference Comment
Δr1607. ± 25.kJ/molIMRBDamrauer, Kass, et al., 1988gas phase; Between Me2NH and fluorobenzene

References

Damrauer, Kass, et al., 1988
Damrauer, R.; Kass, S.R.; DePuy, C.H.,
Gas-Phase Acidities of Methylsilanes: C-H versus Si-H,
Organomet., 1988, 7, 3, 637, https://doi.org/10.1021/om00093a011
. [all data]