IBr2 anion
- Formula: Br2I-
- Molecular weight: 286.713

Reaction thermochemistry data

Data compiled by: John E. Bartmess
Individual Reactions
By formula: Br2I- + BrI = (Br2I- • BrI)
Quantity | Value | Units | Method | Reference | Comment |
---|---|---|---|---|---|
ΔrH° | 83.26 | kJ/mol | Ther | Finch, Gates, et al., 1977 | gas phase; Structure appears to be BrIBr-: Sanov, Sanford, et al., 1999 |
ΔrH° | 159.8 | kJ/mol | N/A | Check, Faust, et al., 2001 | gas phase; FeF4-; ; ΔS(EA)=5.7 |
Quantity | Value | Units | Method | Reference | Comment |
ΔrG° | 114.2 | kJ/mol | N/A | Check, Faust, et al., 2001 | gas phase; FeF4-; ; ΔS(EA)=5.7 |

Ion clustering data

Data compiled by: John E. Bartmess
Clustering reactions
By formula: Br2I- + BrI = (Br2I- • BrI)
Quantity | Value | Units | Method | Reference | Comment |
---|---|---|---|---|---|
ΔrH° | 83.26 | kJ/mol | Ther | Finch, Gates, et al., 1977 | gas phase; Structure appears to be BrIBr-: Sanov, Sanford, et al., 1999 |
ΔrH° | 159.8 | kJ/mol | N/A | Check, Faust, et al., 2001 | gas phase; FeF4-; ; ΔS(EA)=5.7 |
Quantity | Value | Units | Method | Reference | Comment |
ΔrG° | 114.2 | kJ/mol | N/A | Check, Faust, et al., 2001 | gas phase; FeF4-; ; ΔS(EA)=5.7 |

References

Finch, Gates, et al., 1977
Finch, A.; Gates, P.N.; Peake, S.J.,
Thermochemistry of polyhalides. III. Cesium and rubidium tetrachloroiodates,
J. Inorg. Nucl. Chem., 1977, 39, 2135. [all data]
Sanov, Sanford, et al., 1999
Sanov, A.; Sanford, T.; Butler, L.J.; Vala, J.; Kosloff, R.; Lineberger, W.C.,
Photodissociation dynamics of gas-phase BrICl- and IBr2- anions,
J. Phys. Chem. A, 1999, 103, 49, 10244-10254, https://doi.org/10.1021/jp9920803
. [all data]
Check, Faust, et al., 2001
Check, C.E.; Faust, T.O.; Bailey, J.M.; Wright, B.J.; Gilbert, T.M.; Sunderlin, L.S.,
Addition of Polarization and Diffuse Functions to the LANL2DZ Basis Set for P-Block Elements,
J. Phys. Chem. A,, 2001, 105, 34, 8111, https://doi.org/10.1021/jp011945l
. [all data]