HOCH=CHO anion
- Formula: C2H3O2-
- Molecular weight: 59.0446

Gas phase ion energetics data

Data compiled by: John E. Bartmess
Protonation reactions
By formula: C2H3O2- + H+ = C2H4O2
Quantity | Value | Units | Method | Reference | Comment |
---|---|---|---|---|---|
ΔrG° | >1536. ± 8.4 | kJ/mol | IMRB | Dawson and Nibbering, 1980 | gas phase; G3MP2B3 calculations put dGacid ca. 353 kcal/mol |

References

Dawson and Nibbering, 1980
Dawson, J.H.J.; Nibbering, N.M.M.,
The gas phase anionic chemistry of saturated and unsaturated aliphatic nitriles,
Int. J. Mass Spectrom. Ion Phys., 1980, 33, 3. [all data]