VF4..F anion
- Formula: F5V-
- Molecular weight: 145.9341

Gas phase thermochemistry data

Data compiled by: John E. Bartmess
Quantity | Value | Units | Method | Reference | Comment |
---|---|---|---|---|---|
ΔfH°gas | -446. ± 12. | kcal/mol | Ther | Sidorov, Boltalina, et al., 1989 | value altered from reference due to conversion from electron convention to ion convention |

Gas phase ion energetics data

Data compiled by: John E. Bartmess
Electron affinity of neutral species
EAneutral (eV) | Method | Reference | Comment |
---|---|---|---|
4.45 ± 0.26 | R-A | Sidorov, Boltalina, et al., 1989 | value altered from reference due to conversion from electron convention to ion convention |

References

Sidorov, Boltalina, et al., 1989
Sidorov, L.N.; Boltalina, O.V.; Borschevskii, A.Ya.,
Electron Affinities of Vanadium Fluorides. Additional Experimental Data and Corrections.,
Int. J. Mass Spectrom. Ion Proc., 1989, 87, 2, R1, https://doi.org/10.1016/0168-1176(89)80025-4
. [all data]