CeF3..F anion
- Formula: CeF4-
- Molecular weight: 216.110

Gas phase thermochemistry data

Data compiled by: John E. Bartmess
Quantity | Value | Units | Method | Reference | Comment |
---|---|---|---|---|---|
ΔfH°gas | -1999. ± 29. | kJ/mol | TDEq | Sidorov, Sorokin, et al., 1981 | value altered from reference due to conversion from electron convention to ion convention |

Gas phase ion energetics data

Data compiled by: John E. Bartmess
Electron affinity of neutral species
EAneutral (eV) | Method | Reference | Comment |
---|---|---|---|
3.60 ± 0.30 | R-A | Sidorov, Sorokin, et al., 1981 | value altered from reference due to conversion from electron convention to ion convention |

References

Sidorov, Sorokin, et al., 1981
Sidorov, L.N.; Sorokin, I.D.; Nitikin, N.I.; Skokan, E.V.,
Effusion method for determining the electron affinity and heat of formation of negative ions,
Int. J. Mass Spectrom. Ion Phys., 1981, 39, 311. [all data]