HOCH2CO2 anion
- Formula: C2H3O3-
- Molecular weight: 75.0440

Reaction thermochemistry data

Data compiled by: John E. Bartmess
Individual Reactions
By formula: C2H3O3- + H+ = C2H4O3
Quantity | Value | Units | Method | Reference | Comment |
---|---|---|---|---|---|
ΔrH° | 332.3 ± 2.3 | kcal/mol | TDEq | Caldwell, Renneboog, et al., 1989 | gas phase |
Quantity | Value | Units | Method | Reference | Comment |
ΔrG° | 327.8 ± 2.0 | kcal/mol | TDEq | Caldwell, Renneboog, et al., 1989 | gas phase |

References

Caldwell, Renneboog, et al., 1989
Caldwell, G.; Renneboog, R.; Kebarle, P.,
Gas Phase Acidities of Aliphatic Carboxylic Acids, Based on Measurements of Proton Transfer Equilibria,
Can. J. Chem., 1989, 67, 4, 661, https://doi.org/10.1139/v89-092
. [all data]