EtOCH2CO2 anion

Gas phase ion energetics data

Data compiled by: John E. Bartmess

Electron affinity of neutral species

EAneutral (eV) Method Reference Comment
3.67 ± 0.16D-EACaldwell, Renneboog, et al., 1989

Protonation reactions

C4H7O3- + Hydrogen cation = Acetic acid, ethoxy-

By formula: C4H7O3- + H+ = C4H8O3

Quantity Value Units Method Reference Comment
Δr1431. ± 9.2kJ/molG+TSCaldwell, Renneboog, et al., 1989gas phase
Quantity Value Units Method Reference Comment
Δr1402. ± 8.4kJ/molIMRECaldwell, Renneboog, et al., 1989gas phase

References

Caldwell, Renneboog, et al., 1989
Caldwell, G.; Renneboog, R.; Kebarle, P., Gas Phase Acidities of Aliphatic Carboxylic Acids, Based on Measurements of Proton Transfer Equilibria, Can. J. Chem., 1989, 67, 4, 661, https://doi.org/10.1139/v89-092 . [all data]