cPrCO2 anion
- Formula: C4H5O2-
- Molecular weight: 85.0818

Reaction thermochemistry data

Data compiled by: John E. Bartmess
Individual Reactions
By formula: C4H5O2- + H+ = C4H6O2
Quantity | Value | Units | Method | Reference | Comment |
---|---|---|---|---|---|
ΔrH° | 1448. ± 9.2 | kJ/mol | G+TS | Caldwell, Renneboog, et al., 1989 | gas phase |
Quantity | Value | Units | Method | Reference | Comment |
ΔrG° | 1418. ± 8.4 | kJ/mol | IMRE | Caldwell, Renneboog, et al., 1989 | gas phase |

Gas phase ion energetics data

Data compiled by: John E. Bartmess
Electron affinity of neutral species
EAneutral (eV) | Method | Reference | Comment |
---|---|---|---|
3.50 ± 0.16 | D-EA | Caldwell, Renneboog, et al., 1989 |
Protonation reactions
By formula: C4H5O2- + H+ = C4H6O2
Quantity | Value | Units | Method | Reference | Comment |
---|---|---|---|---|---|
ΔrH° | 1448. ± 9.2 | kJ/mol | G+TS | Caldwell, Renneboog, et al., 1989 | gas phase |
Quantity | Value | Units | Method | Reference | Comment |
ΔrG° | 1418. ± 8.4 | kJ/mol | IMRE | Caldwell, Renneboog, et al., 1989 | gas phase |

References

Caldwell, Renneboog, et al., 1989
Caldwell, G.; Renneboog, R.; Kebarle, P.,
Gas Phase Acidities of Aliphatic Carboxylic Acids, Based on Measurements of Proton Transfer Equilibria,
Can. J. Chem., 1989, 67, 4, 661, https://doi.org/10.1139/v89-092
. [all data]