Xe..NO anion
- Formula: NOXe-
- Molecular weight: 161.300

Gas phase thermochemistry data

Data compiled by: John E. Bartmess
Quantity | Value | Units | Method | Reference | Comment |
---|---|---|---|---|---|
ΔfH°gas | 71.4 ± 2.7 | kJ/mol | Ther | Bowen and Eaton, 1988 |

Ion clustering data

Data compiled by: John E. Bartmess
Clustering reactions
NOXe- + 2 = NOXe2-
By formula: NOXe- + 2Xe = NOXe2-
Quantity | Value | Units | Method | Reference | Comment |
---|---|---|---|---|---|
ΔrH° | 16.3 | kJ/mol | N/A | Hendricks, de Clercq, et al., 2002 | gas phase |

Reaction thermochemistry data

Data compiled by: John E. Bartmess
Individual Reactions
NOXe- + 2 = NOXe2-
By formula: NOXe- + 2Xe = NOXe2-
Quantity | Value | Units | Method | Reference | Comment |
---|---|---|---|---|---|
ΔrH° | 3.90 | kcal/mol | N/A | Hendricks, de Clercq, et al., 2002 | gas phase |

Gas phase ion energetics data

Data compiled by: John E. Bartmess
Electron affinity of neutral species
EAneutral (eV) | Method | Reference | Comment |
---|---|---|---|
0.1930 ± 0.0030 | LPES | Hendricks, de Clercq, et al., 2002 | |
0.204 ± 0.024 | LPES | Bowen and Eaton, 1988 |

References

Bowen and Eaton, 1988
Bowen, K.H.; Eaton, J.G.,
Photodetachment Spectroscopy of Negative Cluster Ions,
in The Structure of Small Molecules and Ions, Ed. R. Naaman, Z. Vager, Plenum NY, 1988, 1988, p.147-169. [all data]
Hendricks, de Clercq, et al., 2002
Hendricks, J.H.; de Clercq, H.L.; Freidhoff, C.B.; Arnold, S.T.; Eaton, J.G.; Fancher, C.; Lyapustina, S.A.; S.,
Anion solvation at the microscopic level: Photoelectron spectroscopy of the solvated anion clusters, NO-(Y)(n), where Y=Ar, Kr, Xe, N2O, H2S, NH3, H2O, and C2H4(OH)(2),
J. Chem. Phys., 2002, 116, 18, 7926-7938, https://doi.org/10.1063/1.1457444
. [all data]