Pt3 anion
- Formula: Pt3-
- Molecular weight: 585.253

Gas phase thermochemistry data

Data compiled by: John E. Bartmess
Quantity | Value | Units | Method | Reference | Comment |
---|---|---|---|---|---|
ΔfH°gas | 188.3 ± 9.7 | kcal/mol | R-EA | Ervin, Ho, et al., 1988 |

Ion clustering data

Data compiled by: John E. Bartmess
Clustering reactions
Pt3- + = COPt3-
By formula: Pt3- + CO = COPt3-
Quantity | Value | Units | Method | Reference | Comment |
---|---|---|---|---|---|
ΔrH° | 53.0 ± 6.9 | kcal/mol | N/A | Grushow and Ervin, 1997 | gas phase |

References

Ervin, Ho, et al., 1988
Ervin, K.M.; Ho, J.; Lineberger, W.C.,
Electronic and Vibrational Structure of Transition Metal Trimers: Photoelectron Spectra of Ni3-, Pd3- and Pt3-,
J. Chem. Phys., 1988, 89, 8, 4514, https://doi.org/10.1063/1.454791
. [all data]
Grushow and Ervin, 1997
Grushow, A.; Ervin, K.M.,
Ligand and Metal Binding Energies in Platinum Carbonyl Cluster Anions: Collision Induced Dissociation of PtM- and Ptm(CO)n-,
J. Chem. Phys., 1997, 106, 23, 9580, https://doi.org/10.1063/1.474116
. [all data]