Benzene, chloropentafluoro- anion
- Formula: C6ClF5-
- Molecular weight: 202.510

Gas phase thermochemistry data

Data compiled by: John E. Bartmess
Quantity | Value | Units | Method | Reference | Comment |
---|---|---|---|---|---|
ΔfH°gas | -891. ± 11. | kJ/mol | R-EA | Dillow and Kebarle, 1989 | ΔGea(423 K) = -20.3 kcal/mol . Assumed EA entropy = 3.5 eu |

References

Dillow and Kebarle, 1989
Dillow, G.W.; Kebarle, P.,
Substituent Effects on the Electron Affinities of Perfluorobenzenes C6F5X,
J. Am. Chem. Soc., 1989, 111, 15, 5592, https://doi.org/10.1021/ja00197a014
. [all data]