FeF3..F anion
- Formula: F4Fe-
- Molecular weight: 131.839

Reaction thermochemistry data

Data compiled by: John E. Bartmess
Individual Reactions
By formula: F4Fe- + F3Fe = F7Fe2-
Quantity | Value | Units | Method | Reference | Comment |
---|---|---|---|---|---|
ΔrH° | 189. ± 24. | kJ/mol | TDAs | Sidirov, Borshchevsky, et al., 1986 | gas phase; value altered from reference due to conversion from electron convention to ion convention |
ΔrH° | 204. ± 4.2 | kJ/mol | TDAs | Sorokin, Sidorov, et al., 1981 | gas phase; ΔHf(A-) at 0 K; value altered from reference due to conversion from electron convention to ion convention |

Gas phase ion energetics data

Data compiled by: John E. Bartmess
Electron affinity of neutral species
EAneutral (eV) | Method | Reference | Comment |
---|---|---|---|
3.47 ± 0.27 | R-A | Boltalina, Borshchevskii, et al., 1992 | Critical review; value altered from reference due to conversion from electron convention to ion convention |

Ion clustering data

Data compiled by: John E. Bartmess
Clustering reactions
By formula: F4Fe- + F3Fe = F7Fe2-
Quantity | Value | Units | Method | Reference | Comment |
---|---|---|---|---|---|
ΔrH° | 189. ± 24. | kJ/mol | TDAs | Sidirov, Borshchevsky, et al., 1986 | gas phase; value altered from reference due to conversion from electron convention to ion convention |
ΔrH° | 204. ± 4.2 | kJ/mol | TDAs | Sorokin, Sidorov, et al., 1981 | gas phase; ΔHf(A-) at 0 K; value altered from reference due to conversion from electron convention to ion convention |

Gas phase thermochemistry data

Data compiled by: John E. Bartmess
Quantity | Value | Units | Method | Reference | Comment |
---|---|---|---|---|---|
ΔfH°gas | -339.1 ± 4.5 | kcal/mol | Ther | Boltalina, Borshchevskii, et al., 1992 | Critical review; value altered from reference due to conversion from electron convention to ion convention |

References

Sidirov, Borshchevsky, et al., 1986
Sidirov, L.N.; Borshchevsky, A.Ya.; Boltalina, O.V.; Sorokin, I.D.; Skokan, E.V.,
Electron affinities of gaseous iron fluorides and dimers,
Int. J. Mass Spectrom. Ion Processes, 1986, 73, 1. [all data]
Sorokin, Sidorov, et al., 1981
Sorokin, I.D.; Sidorov, L.N.; Nikitin, M.I.; Skokan, E.V.,
Mass-spectrometric determination of the enthalpies of dissociation of gaseous complex fluorides into neutral and charged particles. V. Heats of formation of FeF3- and FeF4-,
Int. J. Mass Spectrom. Ion Phys., 1981, 41, 45. [all data]
Boltalina, Borshchevskii, et al., 1992
Boltalina, O.V.; Borshchevskii, A.Y.; Sidorov, L.N.,
Thermochemistry of 3d Elements Fluorides and Their Negative Ions in Gas Phase,
Russ. J. Phys. Chem., 1992, 66, 1223. [all data]