mMe-C6H4CHCN anion
- Formula: C9H8N-
- Molecular weight: 130.1671

Reaction thermochemistry data

Data compiled by: John E. Bartmess
Individual Reactions
By formula: C9H8N- + H+ = C9H9N
Quantity | Value | Units | Method | Reference | Comment |
---|---|---|---|---|---|
ΔrH° | 350.8 ± 2.5 | kcal/mol | G+TS | Taft and Topsom, 1987 | gas phase |
Quantity | Value | Units | Method | Reference | Comment |
ΔrG° | 344.2 ± 2.0 | kcal/mol | IMRE | Taft and Topsom, 1987 | gas phase |

Gas phase ion energetics data

Data compiled by: John E. Bartmess
Electron affinity of neutral species
EAneutral (eV) | Method | Reference | Comment |
---|---|---|---|
1.95 ± 0.14 | D-EA | Taft and Topsom, 1987 |
Protonation reactions
By formula: C9H8N- + H+ = C9H9N
Quantity | Value | Units | Method | Reference | Comment |
---|---|---|---|---|---|
ΔrH° | 350.8 ± 2.5 | kcal/mol | G+TS | Taft and Topsom, 1987 | gas phase |
Quantity | Value | Units | Method | Reference | Comment |
ΔrG° | 344.2 ± 2.0 | kcal/mol | IMRE | Taft and Topsom, 1987 | gas phase |

References

Taft and Topsom, 1987
Taft, R.W.; Topsom, R.D.,
The Nature and Analysis of Substituent Effects,
Prog. Phys. Org. Chem., 1987, 16, 1. [all data]