RuF4 radical anion

Gas phase ion energetics data

Data compiled by: John E. Bartmess

Electron affinity of neutral species

EAneutral (eV) Method Reference Comment
4.75 ± 0.28TDEqKuznetsov, Korobov, et al., 1989PtF4- + RuF4 <=> RuF4- + PtF4, ΔH = 17.5±2.9 kcal/mol.

References

Kuznetsov, Korobov, et al., 1989
Kuznetsov, S.V.; Korobov, M.V.; Sidorov, L.N.; Savinova, L.N.; Shipachev, V.A.; Mit'kin, V.N., Gas Phase Negative Ions of Platinum Metal Fluorides. I. Electron Affinity of Platinum Metal Tetrafluorides, Int. J. Mass Spectrom. Ion Proc., 1989, 87, 1, 1, https://doi.org/10.1016/0168-1176(89)80001-1 . [all data]