bicyclo[1.1.0]butanide anion
- Formula: C4H5-
- Molecular weight: 53.0830

Gas phase ion energetics data

Data compiled by: John E. Bartmess
Electron affinity of neutral species
EAneutral (eV) | Method | Reference | Comment |
---|---|---|---|
0.77 ± 0.33 | IMRB | Kass and Chou, 1988 | between O2 and SO2 |
Protonation reactions
Quantity | Value | Units | Method | Reference | Comment |
---|---|---|---|---|---|
ΔrH° | 1670. ± 17. | kJ/mol | G+TS | Kass and Chou, 1988 | gas phase; Acidity between NH3, Me2NH, near nPrNH2. |
Quantity | Value | Units | Method | Reference | Comment |
ΔrG° | 1636. ± 17. | kJ/mol | IMRB | Kass and Chou, 1988 | gas phase; Acidity between NH3, Me2NH, near nPrNH2. |

Reaction thermochemistry data

Data compiled by: John E. Bartmess

Individual Reactions

C4H5- + Hydrogen cation = Bicyclo[1.1.0]butane

By formula: C4H5- + H+ = C4H6

Quantity Value Units Method Reference Comment
Δr1670. ± 17.kJ/molG+TSKass and Chou, 1988gas phase; Acidity between NH3, Me2NH, near nPrNH2.
Quantity Value Units Method Reference Comment
Δr1636. ± 17.kJ/molIMRBKass and Chou, 1988gas phase; Acidity between NH3, Me2NH, near nPrNH2.

References

Kass and Chou, 1988
Kass, S.R.; Chou, P.K.,
The Bicyclobutyl Anion: An Alkyl Carbanion,
J. Am. Chem. Soc., 1988, 110, 23, 7899, https://doi.org/10.1021/ja00231a063
. [all data]