Cl3 anion
- Formula: Cl3-
- Molecular weight: 106.360

Gas phase thermochemistry data

Data compiled by: John E. Bartmess
Quantity | Value | Units | Method | Reference | Comment |
---|---|---|---|---|---|
ΔfH°gas | -78.03 | kcal/mol | Ther | Nizzi, Pommerening, et al., 1998 | |
ΔfH°gas | -71.80 | kcal/mol | IMRE | Robbiani and Franklin, 1979 | ΔG≈+1 kcal for Cl- + SO2Cl2 <=> Cl3- + SO2 |
ΔfH°gas | -71.8 ± 5.0 | kcal/mol | IMRB | Robbiani and Franklin, 1979, 2 |

Ion clustering data

Data compiled by: John E. Bartmess
Clustering reactions
Quantity | Value | Units | Method | Reference | Comment |
---|---|---|---|---|---|
ΔrH° | 23.7 ± 1.2 | kcal/mol | CIDT | Nizzi, Pommerening, et al., 1998 | gas phase |
ΔrH° | 16.70 | kcal/mol | Ther | Robbiani and Franklin, 1979 | gas phase; ΔG≈+1 kcal for Cl- + SO2Cl2 <=> Cl3- + SO2 |
ΔrH° | <43.60 | kcal/mol | PDis | Lee, Smith, et al., 1979 | gas phase |

Reaction thermochemistry data

Data compiled by: John E. Bartmess

Individual Reactions

Chlorine anion + Chlorine = Cl3-

By formula: Cl- + Cl2 = Cl3-

Quantity Value Units Method Reference Comment
Δr23.7 ± 1.2kcal/molCIDTNizzi, Pommerening, et al., 1998gas phase
Δr16.70kcal/molTherRobbiani and Franklin, 1979gas phase; ΔG≈+1 kcal for Cl- + SO2Cl2 <=> Cl3- + SO2
Δr<43.60kcal/molPDisLee, Smith, et al., 1979gas phase

Gas phase ion energetics data

Data compiled by: John E. Bartmess

Electron affinity of neutral species

EAneutral (eV) Method Reference Comment
<4.640 ± 0.010LPESKaledin, Heaven, et al., 1999
5.10 ± 0.20NBAEBowen, Liesegang, et al., 1983
>4.30 ± 0.22R-ARobbiani and Franklin, 1979

References

Nizzi, Pommerening, et al., 1998
Nizzi, K.E.; Pommerening, C.A.; Sunderlin, L.S.,
Gas-phase thermochemistry of polyhalide anions,
J. Phys. Chem. A, 1998, 102, 39, 7674-7679, https://doi.org/10.1021/jp9824508
. [all data]
Robbiani and Franklin, 1979
Robbiani, R.; Franklin, J.L.,
Formation of the trihalide ion Cl3- in the gas phase,
J. Am. Chem. Soc., 1979, 101, 764. [all data]
Robbiani and Franklin, 1979, 2
Robbiani, R.; Franklin, J.L.,
Negative ion-molecule reaction in sulfuryl halides,
J. Am. Chem. Soc., 1979, 101, 3709. [all data]
Lee, Smith, et al., 1979
Lee, L.C.; Smith, G.P.; Moseley, J.T.; Cosby, P.C.; Guest, J.A.,
Photodissociation and photodetachment of Cl2-, ClO-, Cl3-, and BrCl2-,
J. Chem. Phys., 1979, 70, 3237. [all data]