Cl3SiO anion

Reaction thermochemistry data

Data compiled by: John E. Bartmess

Individual Reactions

Cl3OSi- + Hydrogen cation = HCl3OSi

By formula: Cl3OSi- + H+ = HCl3OSi

Quantity Value Units Method Reference Comment
Δr1359. ± 18.kJ/molG+TSDamrauer, Simon, et al., 1991gas phase; Between CF3CO2H, HNO3
Quantity Value Units Method Reference Comment
Δr1326. ± 17.kJ/molIMRBDamrauer, Simon, et al., 1991gas phase; Between CF3CO2H, HNO3

Gas phase ion energetics data

Data compiled by: John E. Bartmess

Protonation reactions

Cl3OSi- + Hydrogen cation = HCl3OSi

By formula: Cl3OSi- + H+ = HCl3OSi

Quantity Value Units Method Reference Comment
Δr1359. ± 18.kJ/molG+TSDamrauer, Simon, et al., 1991gas phase; Between CF3CO2H, HNO3
Quantity Value Units Method Reference Comment
Δr1326. ± 17.kJ/molIMRBDamrauer, Simon, et al., 1991gas phase; Between CF3CO2H, HNO3

References

Damrauer, Simon, et al., 1991
Damrauer, R.; Simon, R.; Krempp, M., Effect of Substituents on the Gas-Phase Acidity of Silanols, J. Am. Chem. Soc., 1991, 113, 12, 4431, https://doi.org/10.1021/ja00012a009 . [all data]