(Na)[Cr(Cp)(CO)3]
- Formula: C8H5CrNaO3
- Molecular weight: 224.1094

Reaction thermochemistry data

Data compiled by: José A. Martinho Simões
Individual Reactions
0.5 (solution) +
(cr) = C8H5CrNaO3 (solution)
By formula: 0.5C16H10Cr2O6 (solution) + Na (cr) = C8H5CrNaO3 (solution)
Quantity | Value | Units | Method | Reference | Comment |
---|---|---|---|---|---|
ΔrH° | -68.14 ± 0.86 | kcal/mol | RSC | Kiss, Nolan, et al., 1994 | solvent: Tetrahydrofuran; The reaction enthalpy was calculated from the enthalpies of the following reactions: 0.5[Cr(Cp)(CO)3]2(solution) + (Na)[Cr(Cp)(CO)2(PPh3)](solution) = (Na)[Cr(Cp)(CO)3](solution) + Cr(Cp)(CO)2(PPh3)(solution), -8.34 ± 0.1 kcal/mol, Cr(Cp)(CO)2(PPh3)(solution) + (Na)(Ph2CO)(solution) = (Na)[Cr(Cp)(CO)2(PPh3)](solution) + Ph2CO(solution), -21.3 ± 0.60 kcal/mol, and Ph2CO(solution) + Na(cr) = (Na)(Ph2CO)(solution), -38.50 ± 0.60 kcal/mol Kiss, Nolan, et al., 1994. |
C8H6CrO3 (solution) + C13H20CrNaO2P (solution) = C13H21CrO2P (solution) + C8H5CrNaO3 (solution)
By formula: C8H6CrO3 (solution) + C13H20CrNaO2P (solution) = C13H21CrO2P (solution) + C8H5CrNaO3 (solution)
Quantity | Value | Units | Method | Reference | Comment |
---|---|---|---|---|---|
ΔrH° | -19.7 ± 0.41 | kcal/mol | RSC | Kiss, Nolan, et al., 1994 | solvent: Tetrahydrofuran |

References

Kiss, Nolan, et al., 1994
Kiss, G.; Nolan, S.P.; Hoff, C.D.,
Inorg. Chim. Acta, 1994, 227, 285. [all data]