Os3(CO)11(H)2

Reaction thermochemistry data

Data compiled by: José A. Martinho Simões

Individual Reactions

C11H2O11Os (solution) + Carbon monoxide (solution) = Hydrogen (g) + Osmium, dodecacarbonyltri-, triangulo (solution)

By formula: C11H2O11Os (solution) + CO (solution) = H2 (g) + C12O12Os3 (solution)

Quantity Value Units Method Reference Comment
Δr-37.7 ± 9.6kJ/molES/KSPoë, Sampson, et al., 1993solvent: Decalin; Calculated from equilibrium and kinetic data Poë, Sampson, et al., 1993.
Δr-77.4 ± 9.7kJ/molN/APoë, Sampson, et al., 1993solvent: Decalin; Calculated from data for the reactions Os3(CO)10(H)2(solution) + CO(solution) = Os3(CO)11(H)2(solution) (hrxn [kJ/mol]=-39.7±1.3, srxn [J/(mol K)]=-80.3±3.8) and Os3(CO)11(H)2(solution) + CO(solution) = Os3(CO)12(solution) + H2(g) (hrxn [kJ/mol]=-37.7±9.6, srxn [J/(mol K)]=-32.6±27.6) Poë, Sampson, et al., 1993.

References

Poë, Sampson, et al., 1993
Poë, A.J.; Sampson, C.N.; Smith, R.T.; Zheng, Y., J. Am. Chem. Soc., 1993, 115, 3174. [all data]