Mg(Br)(OMe)
- Formula: CH3BrMgO
- Molecular weight: 135.243

Condensed phase thermochemistry data

Data compiled by: José A. Martinho Simões
Quantity | Value | Units | Method | Reference | Comment |
---|---|---|---|---|---|
ΔfH°solid | -691.2 | kJ/mol | RSC | Holm, 1983 | Value corrected based on a set of ancillary data by J.A. Martinho Simões; The enthalpy of formation was not recalculated due to the lack of information in the original reference. |

Reaction thermochemistry data

Data compiled by: José A. Martinho Simões
Individual Reactions
(solution) + C5H11BrMg (solution) = CH3BrMgO (cr) +
(solution)
By formula: CH4O (solution) + C5H11BrMg (solution) = CH3BrMgO (cr) + C5H12 (solution)
Quantity | Value | Units | Method | Reference | Comment |
---|---|---|---|---|---|
ΔrH° | -219.7 | kJ/mol | RSC | Holm, 1983 | solvent: Diethyl ether |

References

Holm, 1983
Holm, T.,
Acta Chem. Scand. B, 1983, 37, 797. [all data]