Ru(dmpe)2(CO)

Reaction thermochemistry data

Data compiled by: José A. Martinho Simões

Individual Reactions

C12H34P4Ru (solution) + Carbon monoxide (solution) = C13H32OP4Ru (solution) + Hydrogen (solution)

By formula: C12H34P4Ru (solution) + CO (solution) = C13H32OP4Ru (solution) + H2 (solution)

Quantity Value Units Method Reference Comment
Δr-84.9kJ/molPACBelt, Scaiano, et al., 1993solvent: Cyclohexane; The reaction enthalpy relies on 0.85 for the quantum yield of H2 dissociation.

References

Belt, Scaiano, et al., 1993
Belt, S.T.; Scaiano, J.C.; Whittlesey, M.K., J. Am. Chem. Soc., 1993, 115, 1921. [all data]