Cr(CO)5(C2F4)

Reaction thermochemistry data

Data compiled by: José A. Martinho Simões

Individual Reactions

C7CrF4O5 (g) = Ethene, tetrafluoro- (g) + C5CrO5 (g)

By formula: C7CrF4O5 (g) = C2F4 (g) + C5CrO5 (g)

Quantity Value Units Method Reference Comment
Δr82.4 ± 5.9kJ/molKinGWells, House, et al., 1994The reaction enthalpy relies on the measured activation energy and on the assumption of a negligible barrier for product recombination Wells, House, et al., 1994.

References

Wells, House, et al., 1994
Wells, J.R.; House, P.G.; Weitz, E., J. Phys. Chem., 1994, 98, 8343. [all data]