[Sn(Me)3]3(N)
- Formula: C9H27NSn3
- Molecular weight: 505.447

Condensed phase thermochemistry data

Data compiled by: José A. Martinho Simões
Quantity | Value | Units | Method | Reference | Comment |
---|---|---|---|---|---|
ΔfH°solid | -122. ± 12. | kJ/mol | Review | Martinho Simões | The enthalpy of formation relies on -379.8 ± 4.1 kJ/mol for the enthalpy of formation of Sn(Me)3(OH)(cr). |

Phase change data

Data compiled by: José A. Martinho Simões
Quantity | Value | Units | Method | Reference | Comment |
---|---|---|---|---|---|
ΔsubH° | 62.8 | kJ/mol | RSC | Baldwin, Lappert, et al., 1972 |

Reaction thermochemistry data

Data compiled by: José A. Martinho Simões
Individual Reactions
C9H27NSn3 (cr) + ( • 55
) (solution) + 3
(l) = (
• 55
) (solution) + 3C3H10OSn (cr)
By formula: C9H27NSn3 (cr) + (HCl • 55H2O) (solution) + 3H2O (l) = (H4ClN • 55H2O) (solution) + 3C3H10OSn (cr)
Quantity | Value | Units | Method | Reference | Comment |
---|---|---|---|---|---|
ΔrH° | -293.7 ± 1.3 | kJ/mol | RSC | Baldwin, Lappert, et al., 1972 |

Gas phase thermochemistry data

Data compiled by: José A. Martinho Simões
Quantity | Value | Units | Method | Reference | Comment |
---|---|---|---|---|---|
ΔfH°gas | -59.1 | kJ/mol | Review | Martinho Simões | The enthalpy of formation relies on -379.8 ± 4.1 kJ/mol for the enthalpy of formation of Sn(Me)3(OH)(cr). |

References

Martinho Simões
Martinho Simões, J.A.,
Private communication (see http://webbook.nist.gov/chemistry/om/). [all data]
Baldwin, Lappert, et al., 1972
Baldwin, J.C.; Lappert, M.F.; Pedley, J.B.; Poland, J.S.,
J. Chem. Soc., Dalton Trans., 1972, 1943.. [all data]