Sn(Me)3(SBu)
- Formula: C7H18SSn
- Molecular weight: 252.993

Condensed phase thermochemistry data

Data compiled by: José A. Martinho Simões
Quantity | Value | Units | Method | Reference | Comment |
---|---|---|---|---|---|
ΔfH°liquid | -197.4 ± 4.2 | kJ/mol | Review | Martinho Simões | The enthalpy of formation relies on -379.8 ± 4.1 kJ/mol for the enthalpy of formation of Sn(Me)3(OH)(cr). It is also assumed that the enthalpy of solution of BuSH(l) in (HCl,55H2O)(solution) is negligible Baldwin, Lappert, et al., 1972. |

Phase change data

Data compiled by: José A. Martinho Simões
Quantity | Value | Units | Method | Reference | Comment |
---|---|---|---|---|---|
ΔvapH° | 41.8 | kJ/mol | RSC | Baldwin, Lappert, et al., 1972 |

References

Martinho Simões
Martinho Simões, J.A.,
Private communication (see http://webbook.nist.gov/chemistry/om/). [all data]
Baldwin, Lappert, et al., 1972
Baldwin, J.C.; Lappert, M.F.; Pedley, J.B.; Poland, J.S.,
J. Chem. Soc., Dalton Trans., 1972, 1943.. [all data]