Sn(Me)3(OEt)
- Formula: C5H14OSn
- Molecular weight: 208.874

Condensed phase thermochemistry data

Data compiled by: José A. Martinho Simões
Quantity | Value | Units | Method | Reference | Comment |
---|---|---|---|---|---|
ΔfH°liquid | -305.1 ± 4.4 | kJ/mol | Review | Martinho Simões | The enthalpy of formation relies on -379.8 ± 4.1 kJ/mol for the enthalpy of formation of Sn(Me)3(OH)(cr). |

Phase change data

Data compiled by: José A. Martinho Simões
Quantity | Value | Units | Method | Reference | Comment |
---|---|---|---|---|---|
ΔvapH° | 41.8 | kJ/mol | RSC | Baldwin, Lappert, et al., 1972 |

Gas phase thermochemistry data

Data compiled by: José A. Martinho Simões
Quantity | Value | Units | Method | Reference | Comment |
---|---|---|---|---|---|
ΔfH°gas | -263.3 | kJ/mol | Review | Martinho Simões | The enthalpy of formation relies on -379.8 ± 4.1 kJ/mol for the enthalpy of formation of Sn(Me)3(OH)(cr). |

Reaction thermochemistry data

Data compiled by: José A. Martinho Simões
Individual Reactions
C5H14OSn (l) + (l) = C3H10OSn (cr) + (
• 55
) (solution)
By formula: C5H14OSn (l) + H2O (l) = C3H10OSn (cr) + (C2H6O • 55H2O) (solution)
Quantity | Value | Units | Method | Reference | Comment |
---|---|---|---|---|---|
ΔrH° | -18.3 ± 0.41 | kcal/mol | RSC | Baldwin, Lappert, et al., 1972 |

References

Martinho Simões
Martinho Simões, J.A.,
Private communication (see http://webbook.nist.gov/chemistry/om/). [all data]
Baldwin, Lappert, et al., 1972
Baldwin, J.C.; Lappert, M.F.; Pedley, J.B.; Poland, J.S.,
J. Chem. Soc., Dalton Trans., 1972, 1943.. [all data]