Ge(Me)3(SBu)
- Formula: C7H18GeS
- Molecular weight: 206.92

Gas phase thermochemistry data

Data compiled by: José A. Martinho Simões
Quantity | Value | Units | Method | Reference | Comment |
---|---|---|---|---|---|
ΔfH°gas | -229.1 | kJ/mol | Review | Martinho Simões | The enthalpy of formation relies on -569. ± 17. kJ/mol for the estimated enthalpy of formation of [Ge(Me)3]2O(l) Baldwin, Lappert, et al., 1972. It is also assumed that the enthalpy of solution of BuSH(l) in (HCl,55H2O)(solution) is negligible Baldwin, Lappert, et al., 1972. |

Condensed phase thermochemistry data

Data compiled by: José A. Martinho Simões
Quantity | Value | Units | Method | Reference | Comment |
---|---|---|---|---|---|
ΔfH°liquid | -270.9 ± 8.4 | kJ/mol | Review | Martinho Simões | The enthalpy of formation relies on -569. ± 17. kJ/mol for the estimated enthalpy of formation of [Ge(Me)3]2O(l) Baldwin, Lappert, et al., 1972. It is also assumed that the enthalpy of solution of BuSH(l) in (HCl,55H2O)(solution) is negligible Baldwin, Lappert, et al., 1972. |

Phase change data

Data compiled by: José A. Martinho Simões
Quantity | Value | Units | Method | Reference | Comment |
---|---|---|---|---|---|
ΔvapH° | 41.8 | kJ/mol | RSC | Baldwin, Lappert, et al., 1972 |

References

Martinho Simões
Martinho Simões, J.A.,
Private communication (see http://webbook.nist.gov/chemistry/om/). [all data]
Baldwin, Lappert, et al., 1972
Baldwin, J.C.; Lappert, M.F.; Pedley, J.B.; Poland, J.S.,
J. Chem. Soc., Dalton Trans., 1972, 1943.. [all data]